BDBM290479 3-[4-(4-Cyanonaphthalen-1-yl)isoquinolin-6-yl]-2-methyl propionic acid ::US10100016, Compound 16
SMILES CC(Cc1ccc2cncc(-c3ccc(C#N)c4ccccc34)c2c1)C(O)=O
InChI Key InChIKey=RANHMPZYKBBJFG-UHFFFAOYSA-N
Data  1 IC50
  Tab Delimited (TSV)   2D SDfile   Computed 3D by Vconf -m prep SDfile
Find this compound or compounds like it in BindingDB:
Activity Spreadsheet -- Enzyme Inhibition Constant Data from BindingDB
Found 1 hit for monomerid = 290479
TargetSolute carrier family 22 member 12(Homo sapiens (Human))
Shanghai Yingli Pharmaceutical
US Patent
LigandPNGBDBM290479(3-[4-(4-Cyanonaphthalen-1-yl)isoquinolin-6-yl]-2-m...)
Affinity DataIC50:  15nM. Assay description: Human embryonic kidney cells (HEK293) was incubated in DMEM tissue culture medium, at 37° C., under 5% CO2 and 95% air atmosphere. TransIT-293 transf...
Ligand InfoPC cidPC sid
In DepthDetails US Patent